Reaction Details
TargetMitogen-activated protein kinase kinase kinase 20
LigandBDBM50268022
Substrate/Competitorn/a
Meas. Tech.ChEMBL_1704329 (CHEMBL4055562)
IC50 43±n/a nM
Citation Chang, YLu, XShibu, MADai, YBLuo, JZhang, YLi, YZhao, PZhang, ZXu, YTu, ZCZhang, QWYun, CHHuang, CYDing, K Structure Based Design of N-(3-((1H-Pyrazolo[3,4-b]pyridin-5-yl)ethynyl)benzenesulfonamides as Selective Leucine-Zipper and Sterile-? Motif Kinase (ZAK) Inhibitors. J Med Chem60:5927-5932 (2017) 
 
Mitogen-activated protein kinase kinase kinase 20
Name:Mitogen-activated protein kinase kinase kinase 20
Type:PROTEIN
Mol. Mass.:91168.58
Organism:Homo sapiens (Human)
Description:ChEMBL_1495629
Residue:800
BDBM50268022
NameBDBM50268022
Synonyms:CHEMBL4087178
TypeSmall organic molecule
Emp. Form.C23H17ClF2N4O3S
Mol. Mass.502.921
SMILESCC(C)Oc1n[nH]c2ncc(cc12)C#Cc1c(F)ccc(NS(=O)(=O)c2cccc(Cl)c2)c1F