Reaction Details
TargetMitogen-activated protein kinase kinase kinase 20
LigandBDBM50268024
Substrate/Competitorn/a
Meas. Tech.ChEMBL_1704329 (CHEMBL4055562)
IC50 994±n/a nM
Citation Chang, YLu, XShibu, MADai, YBLuo, JZhang, YLi, YZhao, PZhang, ZXu, YTu, ZCZhang, QWYun, CHHuang, CYDing, K Structure Based Design of N-(3-((1H-Pyrazolo[3,4-b]pyridin-5-yl)ethynyl)benzenesulfonamides as Selective Leucine-Zipper and Sterile-? Motif Kinase (ZAK) Inhibitors. J Med Chem60:5927-5932 (2017) 
 
Mitogen-activated protein kinase kinase kinase 20
Name:Mitogen-activated protein kinase kinase kinase 20
Type:PROTEIN
Mol. Mass.:91168.58
Organism:Homo sapiens (Human)
Description:ChEMBL_1495629
Residue:800
BDBM50268024
NameBDBM50268024
Synonyms:CHEMBL4085336
TypeSmall organic molecule
Emp. Form.C21H12ClF2N3O2S
Mol. Mass.443.854
SMILESFc1ccc(NS(=O)(=O)c2cccc(Cl)c2)c(F)c1C#Cc1ccc2[nH]ncc2c1