Reaction Details
TargetGlycogen synthase kinase-3 beta
LigandBDBM50269429
Substrate/Competitorn/a
Meas. Tech.ChEMBL_1706606 (CHEMBL4057839)
IC50 0.100000±n/a nM
Citation Kohara, TNakayama, KWatanabe, KKusaka, SISakai, DTanaka, HFukunaga, KSunada, SNabeno, MSaito, KIEguchi, JIMori, ATanaka, SBessho, TTakiguchi-Hayashi, KHorikawa, T Discovery of novel 2-(4-aryl-2-methylpiperazin-1-yl)-pyrimidin-4-ones as glycogen synthase kinase-3? inhibitors. Bioorg Med Chem Lett27:3733-3738 (2017) 
 
Glycogen synthase kinase-3 beta
Name:Glycogen synthase kinase-3 beta
Type:Enzyme
Mol. Mass.:46756.38
Organism:Homo sapiens (Human)
Description:P49841
Residue:420
BDBM50269429
NameBDBM50269429
Synonyms:CHEMBL4084855
TypeSmall organic molecule
Emp. Form.C21H24N6O2
Mol. Mass.392.4543
SMILESCOc1ccc(cc1)N1CCN([C@H](C)C1)c1nc(cc(=O)n1C)-c1ccncn1