Reaction Details
TargetPlatelet-activating factor receptor
LigandBDBM50013932
Substrate/Competitorn/a
Meas. Tech.ChEBML_154992
IC50 90±n/a nM
Citation Guthrie, RWKaplan, GLMennona, FATilley, JWKierstead, RWO'Donnell, MCrowley, HYaremko, BWelton, AF Propenyl carboxamide derivatives as antagonists of platelet activating factor. J Med Chem33:2856-64 (1990) Platelet-activating factor receptor
Name:Platelet-activating factor receptor
Type:Enzyme Catalytic Domain
Mol. Mass.:39219.60
Organism:Homo sapiens (Human)
Description:PAF Platelet activating factor PTAFR HUMAN::P25105
Residue:342
BDBM50013932
NameBDBM50013932
Synonyms:3-(1-Butyl-6-methoxy-3,4-dihydro-naphthalen-2-yl)-N-(1-methyl-4-pyridin-3-yl-butyl)-acrylamide | CHEMBL328833
TypeSmall organic molecule
Emp. Form.C28H36N2O2
Mol. Mass.432.5976
SMILESCCCCC1=C(CCc2cc(OC)ccc12)\C=C\C(=O)N[C@@H](C)CCCc1cccnc1