Reaction Details
TargetOxoeicosanoid receptor 1
LigandBDBM50275229
Substrate/Competitorn/a
Meas. Tech.ChEMBL_1714532 (CHEMBL4124581)
EC50>100000±n/a nM
Citation Stepniewski, TMTorrens-Fontanals, MRodríguez-Espigares, IGiorgino, TPrimdahl, KGVik, AStenstrřm, YSelent, JHansen, TV Synthesis, molecular modelling studies and biological evaluation of new oxoeicosanoid receptor 1 agonists. Bioorg Med Chem26:3580-3587 (2018) 
 
Oxoeicosanoid receptor 1
Name:Oxoeicosanoid receptor 1
Type:Enzyme Catalytic Domain
Mol. Mass.:45833.20
Organism:Homo sapiens (Human)
Description:TG 1019 0 HUMAN::Q8TDS5
Residue:423
BDBM50275229
NameBDBM50275229
Synonyms:CHEMBL4128214
TypeSmall organic molecule
Emp. Form.C23H32O3
Mol. Mass.356.4984
SMILESCC\C=C/C\C=C/C\C=C/C\C=C/C\C=C/C=C/C(=O)CCC(=O)OC