Reaction Details
TargetCytoplasmic tyrosine-protein kinase BMX
LigandBDBM102620
Substrate/Competitorn/a
Meas. Tech.ChEBML_1715921
IC50 8.0±n/a nM
Citation Wang, BDeng, YChen, YYu, KWang, ALiang, QWang, WChen, CWu, HHu, CMiao, WHur, WWang, WHu, ZWeisberg, ELWang, JRen, TWang, YGray, NSLiu, QLiu, J Structure-activity relationship investigation for benzonaphthyridinone derivatives as novel potent Bruton's tyrosine kinase (BTK) irreversible inhibitors. Eur J Med Chem137:545-557 (2017) 
 
Cytoplasmic tyrosine-protein kinase BMX
Name:Cytoplasmic tyrosine-protein kinase BMX
Type:Tyrosine-protein kinase
Mol. Mass.:78030.42
Organism:Homo sapiens (Human)
Description:P51813
Residue:675
BDBM102620
NameBDBM102620
Synonyms:BMX-IN-1 US10000483, Compound I-14
TypeSmall organic molecule
Emp. Form.C29H24N4O4S
Mol. Mass.524.59
SMILESCc1ccc(cc1NC(=O)C=C)-n1c2c(ccc1=O)cnc1ccc(cc21)-c1ccc(NS(C)(=O)=O)cc1