Reaction Details
TargetCytoplasmic tyrosine-protein kinase BMX
LigandBDBM400817
Substrate/Competitorn/a
Meas. Tech.ChEBML_1715921
IC50 12±n/a nM
Citation Wang, BDeng, YChen, YYu, KWang, ALiang, QWang, WChen, CWu, HHu, CMiao, WHur, WWang, WHu, ZWeisberg, ELWang, JRen, TWang, YGray, NSLiu, QLiu, J Structure-activity relationship investigation for benzonaphthyridinone derivatives as novel potent Bruton's tyrosine kinase (BTK) irreversible inhibitors. Eur J Med Chem137:545-557 (2017) 
 
Cytoplasmic tyrosine-protein kinase BMX
Name:Cytoplasmic tyrosine-protein kinase BMX
Type:Tyrosine-protein kinase
Mol. Mass.:78030.42
Organism:Homo sapiens (Human)
Description:P51813
Residue:675
BDBM400817
NameBDBM400817
Synonyms:QL-XI-76 | US10000483, Compound II-10
TypeSmall organic molecule
Emp. Form.C26H19N3O3
Mol. Mass.421.4474
SMILESCc1ccc(cc1NC(=O)C=C)-n1c2c(ccc1=O)cnc1ccc(cc21)-c1ccoc1