Reaction Details
TargetType-1 angiotensin II receptor A/B
LigandBDBM50228335
Substrate/Competitorn/a
Meas. Tech.ChEMBL_36495 (CHEMBL652312)
IC50 1.3±n/a nM
Citation Spear, KLBrown, MSReinhard, EJMcMahon, EGOlins, GMPalomo, MAPatton, DR Conformational restriction of angiotensin II: cyclic analogues having high potency. J Med Chem33:1935-40 (1990) Type-1 angiotensin II receptor A/B
Name:Type-1 angiotensin II receptor A/B
Type:n/a
Mol. Mass.:n/a
Description:ASSAY_ID of ChEMBL is 901964
Components:This complex has 2 components.
Component 1
Name:Type-1 angiotensin II receptor B
Synonyms:AGTRB_RAT Agtr1 Angiotensin II AT1B Angiotensin II type 1b (AT-1b) receptor Type-1B angiotensin II receptor
Type:Enzyme Catalytic Domain
Mol. Mass.:40929.44
Organism:RAT
Description:Angiotensin II AT1B 0 RAT::P29089
Residue:359
Component 2
Name:Type-1 angiotensin II receptor A
Synonyms:AGTRA_RAT Agtr1 Angiotensin II AT1 Angiotensin II receptor (AT-1) type-1 Type-1A angiotensin II receptor
Type:Enzyme Catalytic Domain
Mol. Mass.:40910.53
Organism:RAT
Description:ANGIOTENSIN AT1 AGTR1 RAT::P25095
Residue:359
BDBM50228335
NameBDBM50228335
Synonyms:CHEMBL263034
TypeSmall organic molecule
Emp. Form.C47H63N13O12S2
Mol. Mass.1066.213
SMILESCC1(C)SSC[C@H](NC(=O)[C@H](CCCN=C(N)N)NC(=O)[C@@H](N)CC(O)=O)C(=O)N[C@@H](Cc2ccc(O)cc2)C(=O)N[C@@H]1C(=O)N[C@@H](Cc1c[nH]cn1)C(=O)N1CCC[C@H]1C(=O)N[C@@H](Cc1ccccc1)C(O)=O