Reaction Details
Target5-hydroxytryptamine receptor 1D
LigandBDBM10755
Substrate/Competitorn/a
Meas. Tech.ChEBML_1668
EC50 16±n/a nM
Citation Macor, JEBurkhart, CAHeym, JHIves, JLLebel, LANewman, MENielsen, JARyan, KSchulz, DWTorgersen, LK 3-(1,2,5,6-Tetrahydropyrid-4-yl)pyrrolo[3,2-b]pyrid-5-one: a potent and selective serotonin (5-HT1B) agonist and rotationally restricted phenolic analogue of 5-methoxy-3-(1,2,5,6-tetrahydropyrid-4-yl)indole. J Med Chem33:2087-93 (1990) 5-hydroxytryptamine receptor 1D
Name:5-hydroxytryptamine receptor 1D
Type:Enzyme Catalytic Domain
Mol. Mass.:41780.38
Organism:GUINEA PIG
Description:5-HT1D HTR1D GUINEA PIG::Q60484
Residue:376
BDBM10755
NameBDBM10755
Synonyms:14C-5-hydroxy tryptamine creatinine disulfate 5-HT 5-hydroxy tryptamine creatinine disulfate Serotonin | [3H]-5-HT
TypeSmall organic molecule
Emp. Form.C10H12N2O
Mol. Mass.176.2151
SMILESNCCc1c[nH]c2ccc(O)cc12