Reaction Details
Target3-oxo-5-alpha-steroid 4-dehydrogenase 1/2
LigandBDBM50228778
Substrate/Competitorn/a
Meas. Tech.ChEMBL_210247 (CHEMBL883487)
pH7.4±n/a
Ki 4000±n/a nM
Commentsextracted
Citation Jarman, MBarrie, SEDeadman, JJHoughton, JMcCague, RRowlands, MG Hydroxyperfluoroazobenzenes: novel inhibitors of enzymes of androgen biosynthesis. J Med Chem33:2452-5 (1990) 3-oxo-5-alpha-steroid 4-dehydrogenase 1/2
Name:3-oxo-5-alpha-steroid 4-dehydrogenase 1/2
Synonyms:Steroid 5-alpha-reductase
Type:n/a
Mol. Mass.:n/a
Description:ASSAY_ID of ChEMBL is 204723
Components:This complex has 2 components.
Component 1
Name:3-oxo-5-alpha-steroid 4-dehydrogenase 1
Type:PROTEIN
Mol. Mass.:29788.29
Organism:Rattus norvegicus
Description:ChEMBL_1441437
Residue:259
Component 2
Name:3-oxo-5-alpha-steroid 4-dehydrogenase 2
Synonyms:S5A2_RAT Steroid 5-alpha-reductase | Steroid 5-alpha-reductase 2
Type:PROTEIN
Mol. Mass.:28784.15
Organism:Rattus norvegicus
Description:ChEMBL_205054
Residue:254
BDBM50228778
NameBDBM50228778
Synonyms:4,4''-Dihydroxyoctafluoroazobenzene | CHEMBL79036
TypeSmall organic molecule
Emp. Form.C12H2F8N2O2
Mol. Mass.358.1437
SMILESOc1c(F)c(F)c(\N=N\c2c(F)c(F)c(O)c(F)c2F)c(F)c1F