Reaction Details
TargetCannabinoid receptor 2
LigandBDBM50286064
Substrate/Competitorn/a
Meas. Tech.ChEMBL_1728853 (CHEMBL4144131)
EC50 1.5±n/a nM
Citation Han, SThoresen, LJung, JKZhu, XThatte, JSolomon, MGaidarov, IUnett, DJYoon, WHBarden, JSadeque, AUsmani, AChen, CSemple, GGrottick, AJAl-Shamma, HChristopher, RJones, RM Discovery of APD371: Identification of a Highly Potent and Selective CB ACS Med Chem Lett8:1309-1313 (2017) 
 
Cannabinoid receptor 2
Name:Cannabinoid receptor 2
Type:Enzyme
Mol. Mass.:39366.68
Organism:Rattus norvegicus (Rat)
Description:Q9QZN9
Residue:360
BDBM50286064
NameBDBM50286064
Synonyms:CHEMBL4174510
TypeSmall organic molecule
Emp. Form.C18H22FN5O2
Mol. Mass.359.398
SMILES[H][C@@]12C[C@]1([H])c1c(C2)c(nn1-c1c[n+]([O-])ccn1)C(=O)N[C@H](CF)C(C)(C)C