Reaction Details
TargetAcetylcholinesterase
LigandBDBM50291664
Substrate/Competitorn/a
Meas. Tech.ChEMBL_1731300 (CHEMBL4146836)
IC50 17±n/a nM
Citation Azzouz, RPeauger, LGembus, V?în?a?, MLSopková-de Oliveira Santos, JPapamicaël, CLevacher, V Novel donepezil-like N-benzylpyridinium salt derivatives as AChE inhibitors and their corresponding dihydropyridine "bio-oxidizable" prodrugs: Synthesis, biological evaluation and structure-activity relationship. Eur J Med Chem145:165-190 (2018) 
 
Acetylcholinesterase
Name:Acetylcholinesterase
Type:Enzyme
Mol. Mass.:67792.70
Organism:Homo sapiens (Human)
Description:P22303
Residue:614
BDBM50291664
NameBDBM50291664
Synonyms:CHEMBL4173239
TypeSmall organic molecule
Emp. Form.C25H25Br2NO2
Mol. Mass.531.28
SMILES[Br-].COc1ccc2C(=O)C(Cc3cc[n+](Cc4cccc(C)c4)cc3Br)CCc2c1