Reaction Details
TargetEphrin type-A receptor 8
LigandBDBM50368452
Substrate/Competitorn/a
Meas. Tech.ChEMBL_1736094 (CHEMBL4151630)
Kd 79±n/a nM
Citation Wang, ZZhang, YPinkas, DMFox, AELuo, JHuang, HCui, SXiang, QXu, TXun, QZhu, DTu, ZRen, XBrekken, RABullock, ANLiang, GDing, KLu, X Design, Synthesis, and Biological Evaluation of 3-(Imidazo[1,2- a]pyrazin-3-ylethynyl)-4-isopropyl- N-(3-((4-methylpiperazin-1-yl)methyl)-5-(trifluoromethyl)phenyl)benzamide as a Dual Inhibitor of Discoidin Domain Receptors 1 and 2. J Med Chem61:7977-7990 (2018) 
 
Ephrin type-A receptor 8
Name:Ephrin type-A receptor 8
Type:PROTEIN
Mol. Mass.:111022.09
Organism:Homo sapiens (Human)
Description:ChEMBL_774600
Residue:1005
BDBM50368452
NameBDBM50368452
Synonyms:CHEMBL4168305
TypeSmall organic molecule
Emp. Form.C31H31F3N6O
Mol. Mass.560.6126
SMILESCC(C)c1ccc(cc1C#Cc1cnc2cnccn12)C(=O)Nc1cc(CN2CCN(C)CC2)cc(c1)C(F)(F)F