Reaction Details
TargetRibosomal protein S6 kinase alpha-3
LigandBDBM50369721
Substrate/Competitorn/a
Meas. Tech.ChEMBL_1737136 (CHEMBL4152886)
Kd 0.54±n/a nM
Citation Liang, CTian, DRen, XDing, SJia, MXin, MThareja, S The development of Bruton's tyrosine kinase (BTK) inhibitors from 2012 to 2017: A mini-review. Eur J Med Chem151:315-326 (2018) 
 
Ribosomal protein S6 kinase alpha-3
Name:Ribosomal protein S6 kinase alpha-3
Type:Serine/threonine-protein kinase
Mol. Mass.:83740.03
Organism:Homo sapiens (Human)
Description:The human RSK2 sequence differed from the Genbank entry NM_004586 at one residue, V45G. The protein was cloned and purified from baculovirus expression system.
Residue:740
BDBM50369721
NameBDBM50369721
Synonyms:CHEMBL3702836
TypeSmall organic molecule
Emp. Form.C33H35FN8O3
Mol. Mass.610.6812
SMILESCN(C1COC1)C(C)(C)\C=C(/C#N)C(=O)N1CCC[C@H]1Cn1nc(-c2ccc(Oc3ccccc3)cc2F)c2c(N)ncnc12