Reaction Details
TargetAminopeptidase N
LigandBDBM50002022
Substrate/Competitorn/a
Meas. Tech.ChEBML_35496
IC50 2000±n/a nM
Citation Xie, JSoleilhac, JMSchmidt, CPeyroux, JRoques, BPFournié-Zaluski, MC New kelatorphan-related inhibitors of enkephalin metabolism: improved antinociceptive properties. J Med Chem32:1497-503 (1989) Aminopeptidase N
Name:Aminopeptidase N
Type:Protein
Mol. Mass.:108810.25
Organism:Sus scrofa (Pig)
Description:P15145
Residue:963
BDBM50002022
NameBDBM50002022
Synonyms:(2-Benzyl-3-hydroxycarbamoyl-propionylamino)-acetic acid CHEMBL16779
TypeSmall organic molecule
Emp. Form.C13H16N2O5
Mol. Mass.280.2765
SMILESONC(=O)CC(Cc1ccccc1)C(=O)NCC(O)=O