Reaction Details
TargetNeprilysin
LigandBDBM50018211
Substrate/Competitorn/a
Meas. Tech.ChEBML_144458
IC50 1.7±n/a nM
Citation Xie, JSoleilhac, JMSchmidt, CPeyroux, JRoques, BPFournié-Zaluski, MC New kelatorphan-related inhibitors of enkephalin metabolism: improved antinociceptive properties. J Med Chem32:1497-503 (1989) Neprilysin
Name:Neprilysin
Type:Enzyme
Mol. Mass.:85570.75
Organism:Oryctolagus cuniculus (rabbit)
Description:NEP was purified to homogeneity from rabbit kidney.
Residue:750
BDBM50018211
NameBDBM50018211
Synonyms:3-(2-Benzyl-3-hydroxycarbamoyl-propionylamino)-butyric acid | CHEMBL36094
TypeSmall organic molecule
Emp. Form.C15H20N2O5
Mol. Mass.308.3297
SMILESCC(CC(O)=O)NC(=O)C(CC(=O)NO)Cc1ccccc1