Reaction Details
TargetPlatelet-activating factor receptor
LigandBDBM50018327
Substrate/Competitorn/a
Meas. Tech.ChEBML_154997
IC50 180±n/a nM
Citation Tilley, JWClader, JWZawoiski, SWirkus, MLeMahieu, RAO'Donnell, MCrowley, HWelton, AF Biphenylcarboxamide derivatives as antagonists of platelet-activating factor. J Med Chem32:1814-20 (1989) Platelet-activating factor receptor
Name:Platelet-activating factor receptor
Type:Enzyme Catalytic Domain
Mol. Mass.:39219.60
Organism:Homo sapiens (Human)
Description:PAF Platelet activating factor PTAFR HUMAN::P25105
Residue:342
BDBM50018327
NameBDBM50018327
Synonyms:2-Bromo-3',4'-dimethoxy-biphenyl-4-carboxylic acid (1-methyl-4-pyridin-3-yl-butyl)-amide | CHEMBL53750
TypeSmall organic molecule
Emp. Form.C25H27BrN2O3
Mol. Mass.483.397
SMILESCOc1ccc(cc1OC)-c1ccc(cc1Br)C(=O)N[C@H](C)CCCc1cccnc1