Reaction Details
TargetPlatelet-activating factor receptor
LigandBDBM50018329
Substrate/Competitorn/a
Meas. Tech.ChEBML_154997
IC50 60±n/a nM
Citation Tilley, JWClader, JWZawoiski, SWirkus, MLeMahieu, RAO'Donnell, MCrowley, HWelton, AF Biphenylcarboxamide derivatives as antagonists of platelet-activating factor. J Med Chem32:1814-20 (1989) Platelet-activating factor receptor
Name:Platelet-activating factor receptor
Type:Enzyme Catalytic Domain
Mol. Mass.:39219.60
Organism:Homo sapiens (Human)
Description:PAF Platelet activating factor PTAFR HUMAN::P25105
Residue:342
BDBM50018329
NameBDBM50018329
Synonyms:3',4'-Dimethoxy-biphenyl-4-carbothioic acid (1-methyl-4-pyridin-3-yl-butyl)-amide | CHEMBL54041
TypeSmall organic molecule
Emp. Form.C25H28N2O2S
Mol. Mass.420.567
SMILESCOc1ccc(cc1OC)-c1ccc(cc1)C(=S)N[C@H](C)CCCc1cccnc1