Reaction Details
TargetPlatelet-activating factor receptor
LigandBDBM50018335
Substrate/Competitorn/a
Meas. Tech.ChEBML_154997
IC50 630±n/a nM
Citation Tilley, JWClader, JWZawoiski, SWirkus, MLeMahieu, RAO'Donnell, MCrowley, HWelton, AF Biphenylcarboxamide derivatives as antagonists of platelet-activating factor. J Med Chem32:1814-20 (1989) Platelet-activating factor receptor
Name:Platelet-activating factor receptor
Type:Enzyme Catalytic Domain
Mol. Mass.:39219.60
Organism:Homo sapiens (Human)
Description:PAF Platelet activating factor PTAFR HUMAN::P25105
Residue:342
BDBM50018335
NameBDBM50018335
Synonyms:Biphenyl-4-carboxylic acid (4-pyridin-3-yl-butyl)-amide | CHEMBL416120
TypeSmall organic molecule
Emp. Form.C22H22N2O
Mol. Mass.330.4229
SMILESO=C(NCCCCc1cccnc1)c1ccc(cc1)-c1ccccc1