Reaction Details
TargetPlatelet-activating factor receptor
LigandBDBM50018336
Substrate/Competitorn/a
Meas. Tech.ChEBML_154997
IC50 140±n/a nM
Citation Tilley, JWClader, JWZawoiski, SWirkus, MLeMahieu, RAO'Donnell, MCrowley, HWelton, AF Biphenylcarboxamide derivatives as antagonists of platelet-activating factor. J Med Chem32:1814-20 (1989) Platelet-activating factor receptor
Name:Platelet-activating factor receptor
Type:Enzyme Catalytic Domain
Mol. Mass.:39219.60
Organism:Homo sapiens (Human)
Description:PAF Platelet activating factor PTAFR HUMAN::P25105
Residue:342
BDBM50018336
NameBDBM50018336
Synonyms:3',4'-Dimethoxy-biphenyl-4-carbothioic acid (4-pyridin-3-yl-butyl)-amide | CHEMBL300644
TypeSmall organic molecule
Emp. Form.C24H26N2O2S
Mol. Mass.406.54
SMILESCOc1ccc(cc1OC)-c1ccc(cc1)C(=S)NCCCCc1cccnc1