Reaction Details
TargetPlatelet-activating factor receptor
LigandBDBM50018337
Substrate/Competitorn/a
Meas. Tech.ChEBML_154997
IC50 20±n/a nM
Citation Tilley, JWClader, JWZawoiski, SWirkus, MLeMahieu, RAO'Donnell, MCrowley, HWelton, AF Biphenylcarboxamide derivatives as antagonists of platelet-activating factor. J Med Chem32:1814-20 (1989) Platelet-activating factor receptor
Name:Platelet-activating factor receptor
Type:Enzyme Catalytic Domain
Mol. Mass.:39219.60
Organism:Homo sapiens (Human)
Description:PAF Platelet activating factor PTAFR HUMAN::P25105
Residue:342
BDBM50018337
NameBDBM50018337
Synonyms:3'-Methoxy-biphenyl-4-carboxylic acid (1-methyl-4-pyridin-3-yl-butyl)-amide | CHEMBL51238
TypeSmall organic molecule
Emp. Form.C24H26N2O2
Mol. Mass.374.4754
SMILESCOc1cccc(c1)-c1ccc(cc1)C(=O)N[C@H](C)CCCc1cccnc1