Reaction Details
TargetPlatelet-activating factor receptor
LigandBDBM50018342
Substrate/Competitorn/a
Meas. Tech.ChEMBL_154996 (CHEMBL767100)
IC50 115±n/a nM
Citation Guthrie, RWKaplan, GLMennona, FATilley, JWKierstead, RWMullin, JGLeMahieu, RAZawoiski, SO'Donnell, MCrowley, H Pentadienyl carboxamide derivatives as antagonists of platelet-activating factor. J Med Chem32:1820-35 (1989) Platelet-activating factor receptor
Name:Platelet-activating factor receptor
Type:Enzyme Catalytic Domain
Mol. Mass.:39219.60
Organism:Homo sapiens (Human)
Description:PAF Platelet activating factor PTAFR HUMAN::P25105
Residue:342
BDBM50018342
NameBDBM50018342
Synonyms:5,5-Bis-(3-nitro-phenyl)-penta-2,4-dienoic acid (4-pyridin-3-yl-butyl)-amide | CHEMBL52970
TypeSmall organic molecule
Emp. Form.C26H24N4O5
Mol. Mass.472.4926
SMILES[#8-]-[#7+](=O)-c1cccc(c1)-[#6](=[#6]\[#6]=[#6]\[#6](=O)-[#7]-[#6]-[#6]-[#6]-[#6]-c1cccnc1)\c1cccc(c1)-[#7+](-[#8-])=O