Reaction Details
TargetPlatelet-activating factor receptor
LigandBDBM50018363
Substrate/Competitorn/a
Meas. Tech.ChEMBL_154996 (CHEMBL767100)
IC50 300±n/a nM
Citation Guthrie, RWKaplan, GLMennona, FATilley, JWKierstead, RWMullin, JGLeMahieu, RAZawoiski, SO'Donnell, MCrowley, H Pentadienyl carboxamide derivatives as antagonists of platelet-activating factor. J Med Chem32:1820-35 (1989) Platelet-activating factor receptor
Name:Platelet-activating factor receptor
Type:Enzyme Catalytic Domain
Mol. Mass.:39219.60
Organism:Homo sapiens (Human)
Description:PAF Platelet activating factor PTAFR HUMAN::P25105
Residue:342
BDBM50018363
NameBDBM50018363
Synonyms:5,5-Bis-(3-methoxy-phenyl)-penta-2,4-dienoic acid (1-methyl-4-pyridin-3-yl-butyl)-amide | CHEMBL431923
TypeSmall organic molecule
Emp. Form.C29H32N2O3
Mol. Mass.456.576
SMILES[#6]-[#8]-c1cccc(c1)-[#6](=[#6]\[#6]=[#6]\[#6](=O)-[#7]-[#6@@H](-[#6])-[#6]-[#6]-[#6]-c1cccnc1)\c1cccc(-[#8]-[#6])c1