Reaction Details
TargetPlatelet-activating factor receptor
LigandBDBM50018377
Substrate/Competitorn/a
Meas. Tech.ChEBML_154996
IC50 400±n/a nM
Citation Guthrie, RWKaplan, GLMennona, FATilley, JWKierstead, RWMullin, JGLeMahieu, RAZawoiski, SO'Donnell, MCrowley, H Pentadienyl carboxamide derivatives as antagonists of platelet-activating factor. J Med Chem32:1820-35 (1989) Platelet-activating factor receptor
Name:Platelet-activating factor receptor
Type:Enzyme Catalytic Domain
Mol. Mass.:39219.60
Organism:Homo sapiens (Human)
Description:PAF Platelet activating factor PTAFR HUMAN::P25105
Residue:342
BDBM50018377
NameBDBM50018377
Synonyms:5,5-Diphenyl-penta-2,4-dienoic acid (4-pyridin-3-yl-butyl)-amide | CHEMBL51696
TypeSmall organic molecule
Emp. Form.C26H26N2O
Mol. Mass.382.4974
SMILESO=[#6](-[#7]-[#6]-[#6]-[#6]-[#6]-c1cccnc1)\[#6]=[#6]/[#6]=[#6](/c1ccccc1)-c1ccccc1