Reaction Details
TargetOxysterols receptor LXR-beta
LigandBDBM19993
Substrate/Competitorn/a
Meas. Tech.ChEMBL_1748351 (CHEMBL4182861)
EC50 198±n/a nM
Citation Gong, HWeinstein, DSLu, ZDuan, JJStachura, SHaque, LKarmakar, AHemagiri, HRaut, DKGupta, AKKhan, JCamac, DSack, JSPudzianowski, AWu, DRYarde, MShen, DRBorowski, VXie, JHSun, HD'Arienzo, CDabros, MGalella, MAWang, FWeigelt, CAZhao, QFoster, WSomerville, JESalter-Cid, LMBarrish, JCCarter, PHDhar, TGM Identification of bicyclic hexafluoroisopropyl alcohol sulfonamides as retinoic acid receptor-related orphan receptor gamma (ROR?/RORc) inverse agonists. Employing structure-based drug design to improve pregnane X receptor (PXR) selectivity. Bioorg Med Chem Lett28:85-93 (2018) 
 
Oxysterols receptor LXR-beta
Name:Oxysterols receptor LXR-beta
Type:Enzyme Catalytic Domain
Mol. Mass.:50978.79
Organism:Homo sapiens (Human)
Description:P55055
Residue:460
BDBM19993
NameBDBM19993
Synonyms:CHEMBL62136 T 0901317 TO-901317 US10669296, Compound TO901317 [3H]T0901317
TypeSmall organic molecule
Emp. Form.C17H12F9NO3S
Mol. Mass.481.333
SMILESOC(c1ccc(cc1)N(CC(F)(F)F)S(=O)(=O)c1ccccc1)(C(F)(F)F)C(F)(F)F