Reaction Details
TargetMelanocortin receptor 5
LigandBDBM50453139
Substrate/Competitorn/a
Meas. Tech.ChEMBL_1749145 (CHEMBL4183655)
EC50 1.9±n/a nM
Citation Merlino, FZhou, YCai, MCarotenuto, AYousif, AMBrancaccio, DDi Maro, SZappavigna, SLimatola, ANovellino, EGrieco, PHruby, VJ Development of Macrocyclic Peptidomimetics Containing Constrained ?,?-Dialkylated Amino Acids with Potent and Selective Activity at Human Melanocortin Receptors. J Med Chem61:4263-4269 (2018) 
 
Melanocortin receptor 5
Name:Melanocortin receptor 5
Type:Enzyme
Mol. Mass.:36612.92
Organism:Homo sapiens (Human)
Description:P33032
Residue:325
BDBM50453139
NameBDBM50453139
Synonyms:CHEMBL4205548
TypeSmall organic molecule
Emp. Form.C44H57N13O7
Mol. Mass.880.0063
SMILESNC(=N)NCCC[C@@H]1NC(=O)[C@@H](Cc2ccccc2)NC(=O)[C@H](Cc2c[nH]cn2)NC(=O)C2(CCCCC2)NC(=O)CC[C@H](NC(=O)[C@H](Cc2c[nH]c3ccccc23)NC1=O)C(N)=O