Reaction Details
Target5-hydroxytryptamine receptor 1A
LigandBDBM50020580
Substrate/Competitorn/a
Meas. Tech.ChEMBL_587 (CHEMBL615457)
Ki 1.5±n/a nM
Citation Chumpradit, SKung, HFBillings, JGuo, YZWu, YShih, J Preparation and biodistribution of 1-[2-(3-[125I]iodo-4-aminophenyl)ethyl]-4-[3-(trifluoromethyl) phenyl]piperazine and 1-[2-(3-[125I]iodo-4-azidophenyl)ethyl]-4-[3-(trifluoromethyl)phenyl] piperazine. J Med Chem32:543-7 (1989) 5-hydroxytryptamine receptor 1A
Name:5-hydroxytryptamine receptor 1A
Type:n/a
Mol. Mass.:46122.49
Organism:Homo sapiens (Human)
Description:n/a
Residue:422
BDBM50020580
NameBDBM50020580
Synonyms:1-[2-(3-Azido-phenyl)-ethyl]-4-(3-trifluoromethyl-phenyl)-piperazine | CHEMBL359124
TypeSmall organic molecule
Emp. Form.C19H20F3N5
Mol. Mass.375.3908
SMILESFC(F)(F)c1cccc(c1)N1CCN(CCc2cccc(c2)N=[N+]=[N-])CC1