Reaction Details
TargetBeta-lactamase TEM
LigandBDBM50021965
Substrate/Competitorn/a
Meas. Tech.ChEMBL_40226 (CHEMBL653999)
IC50 340±n/a nM
Citation Micetich, RGMaiti, SNSpevak, PHall, TWYamabe, SIshida, NTanaka, MYamazaki, TNakai, AOgawa, K Synthesis and beta-lactamase inhibitory properties of 2 beta-[(1,2,3-triazol-1-yl)methyl]-2 alpha-methylpenam-3 alpha-carboxylic acid 1,1-dioxide and related triazolyl derivatives. J Med Chem30:1469-74 (1987) Beta-lactamase TEM
Name:Beta-lactamase TEM
Type:Enzyme
Mol. Mass.:31512.33
Organism:Escherichia coli
Description:P62593
Residue:286
BDBM50021965
NameBDBM50021965
Synonyms:CHEMBL35418 | Sodium; 3-(5-ethoxycarbonyl-[1,2,3]triazol-1-ylmethyl)-3-methyl-2,2,6-trioxo-2lambda*6*-thia-bicyclo[3.2.0]heptane-4-carboxylate
TypeSmall organic molecule
Emp. Form.C14H16N3O7S
Mol. Mass.370.358
SMILESCCOC(=O)c1cnnn1C[C@@]1(C)[C@@H](C2C(CC2=O)S1(=O)=O)C([O-])=O