Reaction Details
TargetCannabinoid receptor 1
LigandBDBM50459322
Substrate/Competitorn/a
Meas. Tech.ChEMBL_1766243 (CHEMBL4201490)
EC50 0.300000±n/a nM
Citation Liu, YJi, LEno, MKudalkar, SLi, ALSchimpgen, MBenchama, OMorales, PXu, SHurst, DWu, SMohammad, KAWood, JTZvonok, NPapahatjis, DPZhou, HHonrao, CMackie, KReggio, PHohmann, AGMarnett, LJMakriyannis, ANikas, SP ( R)- N-(1-Methyl-2-hydroxyethyl)-13-( S)-methyl-arachidonamide (AMG315): A Novel Chiral Potent Endocannabinoid Ligand with Stability to Metabolizing Enzymes. J Med Chem61:8639-8657 (2018) 
 
Cannabinoid receptor 1
Name:Cannabinoid receptor 1
Type:G Protein-Coupled Receptor (GPCR)
Mol. Mass.:52856.55
Organism:Rattus norvegicus (rat)
Description:P20272
Residue:473
BDBM50459322
NameBDBM50459322
Synonyms:CHEMBL4215369
TypeSmall organic molecule
Emp. Form.C24H39NO
Mol. Mass.357.5726
SMILESCCCCC\C=C/[C@H](C)\C=C/C\C=C/C\C=C/CCCC(=O)NC1CC1