Reaction Details
TargetAldehyde dehydrogenase family 1 member A3
LigandBDBM50459603
Substrate/Competitorn/a
Meas. Tech.ChEMBL_1766763 (CHEMBL4202010)
IC50 90±n/a nM
Citation Huddle, BCGrimley, EBuchman, CDChtcherbinine, MDebnath, BMehta, PYang, KMorgan, CALi, SFelton, JSun, DMehta, GNeamati, NBuckanovich, RJHurley, TDLarsen, SD Structure-Based Optimization of a Novel Class of Aldehyde Dehydrogenase 1A (ALDH1A) Subfamily-Selective Inhibitors as Potential Adjuncts to Ovarian Cancer Chemotherapy. J Med Chem61:8754-8773 (2018) 
 
Aldehyde dehydrogenase family 1 member A3
Name:Aldehyde dehydrogenase family 1 member A3
Type:PROTEIN
Mol. Mass.:56110.85
Organism:Homo sapiens (Human)
Description:ChEMBL_109700
Residue:512
BDBM50459603
NameBDBM50459603
Synonyms:CHEMBL4213331
TypeSmall organic molecule
Emp. Form.C19H15FN4OS
Mol. Mass.366.412
SMILESCn1ncc2c1nc(SCc1cccc(F)c1)n(-c1ccccc1)c2=O