Reaction Details
TargetAldehyde dehydrogenase family 1 member A3
LigandBDBM50459588
Substrate/Competitorn/a
Meas. Tech.ChEMBL_1766763 (CHEMBL4202010)
IC50 120±n/a nM
Citation Huddle, BCGrimley, EBuchman, CDChtcherbinine, MDebnath, BMehta, PYang, KMorgan, CALi, SFelton, JSun, DMehta, GNeamati, NBuckanovich, RJHurley, TDLarsen, SD Structure-Based Optimization of a Novel Class of Aldehyde Dehydrogenase 1A (ALDH1A) Subfamily-Selective Inhibitors as Potential Adjuncts to Ovarian Cancer Chemotherapy. J Med Chem61:8754-8773 (2018) 
 
Aldehyde dehydrogenase family 1 member A3
Name:Aldehyde dehydrogenase family 1 member A3
Type:PROTEIN
Mol. Mass.:56110.85
Organism:Homo sapiens (Human)
Description:ChEMBL_109700
Residue:512
BDBM50459588
NameBDBM50459588
Synonyms:CHEMBL4210115
TypeSmall organic molecule
Emp. Form.C21H17FN4O2S
Mol. Mass.408.449
SMILESFc1cccc(CSc2nc3nn(cc3c(=O)n2-c2ccccc2)C2COC2)c1