Reaction Details
TargetHistone-lysine N-methyltransferase, H3 lysine-79 specific
LigandBDBM50460738
Substrate/Competitorn/a
Meas. Tech.ChEMBL_1770194 (CHEMBL4222306)
Kd 4780±n/a nM
Citation Song, YLi, LChen, YLiu, JXiao, SLian, FZhang, NDing, HZhang, YChen, KJiang, HZhang, CLiu, YCChen, SLuo, C Discovery of potent DOT1L inhibitors by AlphaLISA based High Throughput Screening assay. Bioorg Med Chem26:1751-1758 (2018) 
 
Histone-lysine N-methyltransferase, H3 lysine-79 specific
Name:Histone-lysine N-methyltransferase, H3 lysine-79 specific
Type:Protein
Mol. Mass.:184911.91
Organism:Homo sapiens (Human)
Description:Q8TEK3
Residue:1537
BDBM50460738
NameBDBM50460738
Synonyms:CHEMBL4225123
TypeSmall organic molecule
Emp. Form.C15H10N4OS
Mol. Mass.294.331
SMILESC(=C/c1nn2c(nnc2s1)-c1ccccc1)\c1ccco1