Reaction Details
TargetHistone-lysine N-methyltransferase, H3 lysine-79 specific
LigandBDBM50460742
Substrate/Competitorn/a
Meas. Tech.ChEMBL_1770194 (CHEMBL4222306)
Kd 7080±n/a nM
Citation Song, YLi, LChen, YLiu, JXiao, SLian, FZhang, NDing, HZhang, YChen, KJiang, HZhang, CLiu, YCChen, SLuo, C Discovery of potent DOT1L inhibitors by AlphaLISA based High Throughput Screening assay. Bioorg Med Chem26:1751-1758 (2018) 
 
Histone-lysine N-methyltransferase, H3 lysine-79 specific
Name:Histone-lysine N-methyltransferase, H3 lysine-79 specific
Type:Protein
Mol. Mass.:184911.91
Organism:Homo sapiens (Human)
Description:Q8TEK3
Residue:1537
BDBM50460742
NameBDBM50460742
Synonyms:CHEMBL4228634
TypeSmall organic molecule
Emp. Form.C16H12N4O2S
Mol. Mass.324.357
SMILESCOc1ccccc1-c1nnc2sc(\C=C\c3ccco3)nn12