Reaction Details
TargetRibosyldihydronicotinamide dehydrogenase [quinone]
LigandBDBM23926
Substrate/Competitorn/a
Meas. Tech.ChEMBL_1770604 (CHEMBL4222716)
IC50 913±n/a nM
Citation Alnabulsi, SHussein, BSantina, EAlsalahat, IKadirvel, MMagwaza, RNBryce, RASchwalbe, CHBaldwin, AGRusso, IStratford, IJFreeman, S Evaluation of analogues of furan-amidines as inhibitors of NQO2. Bioorg Med Chem Lett28:1292-1297 (2018) 
 
Ribosyldihydronicotinamide dehydrogenase [quinone]
Name:Ribosyldihydronicotinamide dehydrogenase [quinone]
Type:Protein
Mol. Mass.:25917.25
Organism:Homo sapiens (Human)
Description:P16083
Residue:231
BDBM23926
NameBDBM23926
Synonyms:(E)-resveratrol CHEMBL165 Stilbene, 2f cid_445154 trans-resveratrol
TypeSmall organic molecule
Emp. Form.C14H12O3
Mol. Mass.228.2433
SMILESOc1ccc(\C=C\c2cc(O)cc(O)c2)cc1