Reaction Details
TargetNeprilysin
LigandBDBM50024094
Substrate/Competitorn/a
Meas. Tech.ChEBML_64511
IC50 0.410000±n/a nM
Citation Fournié-Zaluski, MCLucas-Soroca, EDevin, JRoques, BP 1H NMR configurational correlation for retro-inverso dipeptides: application to the determination of the absolute configuration of"enkephalinase" inhibitors. Relationships between stereochemistry and enzyme recognition. J Med Chem29:751-7 (1986) Neprilysin
Name:Neprilysin
Type:Protein
Mol. Mass.:85789.59
Organism:Rattus norvegicus (Rat)
Description:P07861
Residue:750
BDBM50024094
NameBDBM50024094
Synonyms:(R,S) 2-(2-Mercaptomethyl-3-phenyl-propionylamino)-propionic acid | CHEMBL165980
TypeSmall organic molecule
Emp. Form.C13H17NO3S
Mol. Mass.267.344
SMILESC[C@@H](NC(=O)[C@H](CS)Cc1ccccc1)C(O)=O