Reaction Details
TargetNeprilysin
LigandBDBM50024095
Substrate/Competitorn/a
Meas. Tech.ChEBML_64511
IC50 2.3±n/a nM
Citation Fournié-Zaluski, MCLucas-Soroca, EDevin, JRoques, BP 1H NMR configurational correlation for retro-inverso dipeptides: application to the determination of the absolute configuration of"enkephalinase" inhibitors. Relationships between stereochemistry and enzyme recognition. J Med Chem29:751-7 (1986) Neprilysin
Name:Neprilysin
Type:Protein
Mol. Mass.:85789.59
Organism:Rattus norvegicus (Rat)
Description:P07861
Residue:750
BDBM50024095
NameBDBM50024095
Synonyms:(R) N-(1-Mercaptomethyl-2-phenyl-ethyl)-malonamic acid | CHEMBL349404
TypeSmall organic molecule
Emp. Form.C12H15NO3S
Mol. Mass.253.317
SMILESOC(=O)CC(=O)N[C@H](CS)Cc1ccccc1