Reaction Details
TargetNeprilysin
LigandBDBM50024098
Substrate/Competitorn/a
Meas. Tech.ChEBML_64511
IC50 0.750000±n/a nM
Citation Fournié-Zaluski, MCLucas-Soroca, EDevin, JRoques, BP 1H NMR configurational correlation for retro-inverso dipeptides: application to the determination of the absolute configuration of"enkephalinase" inhibitors. Relationships between stereochemistry and enzyme recognition. J Med Chem29:751-7 (1986) Neprilysin
Name:Neprilysin
Type:Protein
Mol. Mass.:85789.59
Organism:Rattus norvegicus (Rat)
Description:P07861
Residue:750
BDBM50024098
NameBDBM50024098
Synonyms:(R,R) 2-(1-Mercaptomethyl-2-phenyl-ethylcarbamoyl)-4-methyl-pentanoic acid | CHEMBL164955
TypeSmall organic molecule
Emp. Form.C16H23NO3S
Mol. Mass.309.424
SMILESCC(C)C[C@H](C(O)=O)C(=O)N[C@H](CS)Cc1ccccc1