Reaction Details
TargetPoly [ADP-ribose] polymerase tankyrase-2
LigandBDBM50188594
Substrate/Competitorn/a
Meas. Tech.ChEMBL_1776109 (CHEMBL4233101)
Kd 4.2±n/a nM
Citation Di Micco, SPulvirenti, LBruno, ITerracciano, SRusso, AVaccaro, MCRuggiero, DMuccilli, VCardullo, NTringali, CRiccio, RBifulco, G Identification by Inverse Virtual Screening of magnolol-based scaffold as new tankyrase-2 inhibitors. Bioorg Med Chem26:3953-3957 (2018) 
 
Poly [ADP-ribose] polymerase tankyrase-2
Name:Poly [ADP-ribose] polymerase tankyrase-2
Type:Enzyme
Mol. Mass.:126937.16
Organism:Homo sapiens (Human)
Description:Q9H2K2
Residue:1166
BDBM50188594
NameBDBM50188594
Synonyms:CHEBI:62878 | CHEMBL1086580
TypeSmall organic molecule
Emp. Form.C14H11F3N2OS
Mol. Mass.312.31
SMILESOc1nc(nc2CCSCc12)-c1ccc(cc1)C(F)(F)F