Reaction Details
TargetHistamine H3 receptor
LigandBDBM50462814
Substrate/Competitorn/a
Meas. Tech.ChEMBL_1776530 (CHEMBL4233522)
Ki 110±n/a nM
Citation Khanfar, MAReiner, DHagenow, SStark, H Design, synthesis, and biological evaluation of novel oxadiazole- and thiazole-based histamine H Bioorg Med Chem26:4034-4046 (2018) 
 
Histamine H3 receptor
Name:Histamine H3 receptor
Type:G Protein-Coupled Receptor (GPCR)
Mol. Mass.:48691.47
Organism:Homo sapiens (Human)
Description:Binding assays were using CHO cells stably expressing hH3R receptors.
Residue:445
BDBM50462814
NameBDBM50462814
Synonyms:CHEMBL4244051
TypeSmall organic molecule
Emp. Form.C14H19N3OS
Mol. Mass.277.385
SMILESCN(C)CCCOc1nc(sc1C)-c1ccncc1