Reaction Details
TargetTyrosine-protein kinase BTK
LigandBDBM50245587
Substrate/Competitorn/a
Meas. Tech.ChEMBL_1778186 (CHEMBL4235178)
IC50 7.0±n/a nM
Citation Liu, LShi, BLi, XWang, XLu, XCai, XHuang, ALuo, GYou, QXiang, H Design and synthesis of benzofuro[3,2-b]pyridin-2(1H)-one derivatives as anti-leukemia agents by inhibiting Btk and PI3K?. Bioorg Med Chem26:4537-4543 (2018) 
 
Tyrosine-protein kinase BTK
Name:Tyrosine-protein kinase BTK
Type:Enzyme
Mol. Mass.:76289.95
Organism:Homo sapiens (Human)
Description:Q06187
Residue:659
BDBM50245587
NameBDBM50245587
Synonyms:CHEMBL4077064 | US10000483, Compound II-4
TypeSmall organic molecule
Emp. Form.C27H21N5O2
Mol. Mass.447.4879
SMILESCn1cc(cn1)-c1ccc2ncc3ccc(=O)n(-c4ccc5CCN(C(=O)C=C)c5c4)c3c2c1