Reaction Details
TargetCannabinoid receptor 1
LigandBDBM50463775
Substrate/Competitorn/a
Meas. Tech.ChEMBL_1779341 (CHEMBL4236333)
EC50 0.400000±n/a nM
Citation Malamas, MSRaghav, JGMa, XHonrao, CWood, JTBenchama, OZhou, HMallipeddi, SMakriyannis, A Oximes short-acting CB1 receptor agonists. Bioorg Med Chem26:4963-4970 (2018) 
 
Cannabinoid receptor 1
Name:Cannabinoid receptor 1
Type:G Protein-Coupled Receptor (GPCR)
Mol. Mass.:52856.55
Organism:Rattus norvegicus (rat)
Description:P20272
Residue:473
BDBM50463775
NameBDBM50463775
Synonyms:CHEMBL4240671
TypeSmall organic molecule
Emp. Form.C22H28F3NO3
Mol. Mass.411.4578
SMILES[H][C@]12CC(C)=CC[C@]1([H])C(C)(C)Oc1cc(cc(O)c21)C(\C)=N\OCCCC(F)(F)F