Reaction Details
TargetDual specificity protein kinase TTK
LigandBDBM241338
Substrate/Competitorn/a
Meas. Tech.ChEMBL_1779767 (CHEMBL4236759)
IC50 11±n/a nM
Citation Woodward, HLInnocenti, PCheung, KJHayes, ARoberts, JHenley, ATFaisal, AMak, GWBox, GWestwood, IMCronin, NCarter, MValenti, MDe Haven Brandon, AO'Fee, LSaville, HSchmitt, JBurke, RBroccatelli, Fvan Montfort, RLMRaynaud, FIEccles, SALinardopoulos, SBlagg, JHoelder, S Introduction of a Methyl Group Curbs Metabolism of Pyrido[3,4- d]pyrimidine Monopolar Spindle 1 (MPS1) Inhibitors and Enables the Discovery of the Phase 1 Clinical Candidate N J Med Chem61:8226-8240 (2018) 
 
Dual specificity protein kinase TTK
Name:Dual specificity protein kinase TTK
Type:Protein
Mol. Mass.:97086.79
Organism:Homo sapiens (Human)
Description:P33981
Residue:857
BDBM241338
NameBDBM241338
Synonyms:US10479788, Example 182 US9409907, 182
TypeSmall organic molecule
Emp. Form.C24H30N8O
Mol. Mass.446.548
SMILESCCOc1cc(ccc1Nc1ncc2cc(C)nc(NCC(C)(C)C)c2n1)-c1nncn1C