Reaction Details
TargetCyclin-A2/Cyclin-dependent kinase 2
LigandBDBM50464040
Substrate/Competitorn/a
Meas. Tech.ChEMBL_1779768 (CHEMBL4236760)
Ki 130±n/a nM
Citation Woodward, HLInnocenti, PCheung, KJHayes, ARoberts, JHenley, ATFaisal, AMak, GWBox, GWestwood, IMCronin, NCarter, MValenti, MDe Haven Brandon, AO'Fee, LSaville, HSchmitt, JBurke, RBroccatelli, Fvan Montfort, RLMRaynaud, FIEccles, SALinardopoulos, SBlagg, JHoelder, S Introduction of a Methyl Group Curbs Metabolism of Pyrido[3,4- d]pyrimidine Monopolar Spindle 1 (MPS1) Inhibitors and Enables the Discovery of the Phase 1 Clinical Candidate N J Med Chem61:8226-8240 (2018) 
 
Cyclin-A2/Cyclin-dependent kinase 2
Name:Cyclin-A2/Cyclin-dependent kinase 2
Type:Protein Complex
Mol. Mass.:n/a
Description:Cdk2/Cyclin A kinase was purified from insect cells coinfected with Cyclin A/Cdk2 baculovirus.
Components:This complex has 2 components.
Component 1
Name:Cyclin-dependent kinase 2
Synonyms:CDK2 CDK2_HUMAN Cell division protein kinase 2 Protein cereblon/Cyclin-dependent kinase 2 | p33 protein kinase
Type:Enzyme Subunit
Mol. Mass.:33938.17
Organism:Homo sapiens (Human)
Description:P24941
Residue:298
Component 2
Name:Cyclin-A2
Synonyms:CCN1 CCNA1 CCNA2_HUMAN Cyclin-A
Type:Enzyme Subunit
Mol. Mass.:48550.19
Organism:Homo sapiens (Human)
Description:P20248
Residue:432
BDBM50464040
NameBDBM50464040
Synonyms:CHEMBL4251352
TypeSmall organic molecule
Emp. Form.C25H30N8O
Mol. Mass.458.5587
SMILESCOc1cc(ccc1Nc1ncc2cc(C)nc(NCC(C)(C)C)c2n1)-c1nnc2CCCn12