Reaction Details
TargetATPase family AAA domain-containing protein 2
LigandBDBM50098251
Substrate/Competitorn/a
Meas. Tech.ChEMBL_1780007 (CHEMBL4236999)
IC50 126±n/a nM
Citation Bamborough, PChung, CWFurze, RCGrandi, PMichon, AMWatson, RJMitchell, DJBarnett, HPrinjha, RKRau, CSheppard, RJWerner, TDemont, EH Aiming to Miss a Moving Target: Bromo and Extra Terminal Domain (BET) Selectivity in Constrained ATAD2 Inhibitors. J Med Chem61:8321-8336 (2018) 
 
ATPase family AAA domain-containing protein 2
Name:ATPase family AAA domain-containing protein 2
Type:PROTEIN
Mol. Mass.:158546.30
Organism:Homo sapiens (Human)
Description:ChEMBL_1500426
Residue:1390
BDBM50098251
NameBDBM50098251
Synonyms:CHEMBL3590391
TypeSmall organic molecule
Emp. Form.C26H34N6O2
Mol. Mass.462.5872
SMILESCc1cc2c(cnc(N[C@@H]3CCNC[C@H]3OCC3CCCCC3)c2[nH]c1=O)-c1cncc(N)c1