Reaction Details
TargetATPase family AAA domain-containing protein 2
LigandBDBM50464127
Substrate/Competitorn/a
Meas. Tech.ChEMBL_1780007 (CHEMBL4236999)
IC50 126±n/a nM
Citation Bamborough, PChung, CWFurze, RCGrandi, PMichon, AMWatson, RJMitchell, DJBarnett, HPrinjha, RKRau, CSheppard, RJWerner, TDemont, EH Aiming to Miss a Moving Target: Bromo and Extra Terminal Domain (BET) Selectivity in Constrained ATAD2 Inhibitors. J Med Chem61:8321-8336 (2018) 
 
ATPase family AAA domain-containing protein 2
Name:ATPase family AAA domain-containing protein 2
Type:PROTEIN
Mol. Mass.:158546.30
Organism:Homo sapiens (Human)
Description:ChEMBL_1500426
Residue:1390
BDBM50464127
NameBDBM50464127
Synonyms:CHEMBL4250812
TypeSmall organic molecule
Emp. Form.C27H35N5O5S
Mol. Mass.541.662
SMILESCO[C@H]1CNC[C@@H](OCC2CCS(=O)(=O)CC2)[C@@H]1Nc1ncc(-c2cncc(C)c2)c2cc(C)c(=O)[nH]c12