Reaction Details
TargetATPase family AAA domain-containing protein 2
LigandBDBM50464129
Substrate/Competitorn/a
Meas. Tech.ChEMBL_1780007 (CHEMBL4236999)
IC50 40±n/a nM
Citation Bamborough, PChung, CWFurze, RCGrandi, PMichon, AMWatson, RJMitchell, DJBarnett, HPrinjha, RKRau, CSheppard, RJWerner, TDemont, EH Aiming to Miss a Moving Target: Bromo and Extra Terminal Domain (BET) Selectivity in Constrained ATAD2 Inhibitors. J Med Chem61:8321-8336 (2018) 
 
ATPase family AAA domain-containing protein 2
Name:ATPase family AAA domain-containing protein 2
Type:PROTEIN
Mol. Mass.:158546.30
Organism:Homo sapiens (Human)
Description:ChEMBL_1500426
Residue:1390
BDBM50464129
NameBDBM50464129
Synonyms:CHEMBL4244134
TypeSmall organic molecule
Emp. Form.C28H34F2N4O2
Mol. Mass.496.592
SMILESCc1cncc(c1)-c1ccc(N[C@@H]2CCNC[C@H]2OCC2CCC(F)(F)CC2)c2[nH]c(=O)c(C)cc12