Reaction Details
TargetATPase family AAA domain-containing protein 2
LigandBDBM50464134
Substrate/Competitorn/a
Meas. Tech.ChEMBL_1780007 (CHEMBL4236999)
IC50 100±n/a nM
Citation Bamborough, PChung, CWFurze, RCGrandi, PMichon, AMWatson, RJMitchell, DJBarnett, HPrinjha, RKRau, CSheppard, RJWerner, TDemont, EH Aiming to Miss a Moving Target: Bromo and Extra Terminal Domain (BET) Selectivity in Constrained ATAD2 Inhibitors. J Med Chem61:8321-8336 (2018) 
 
ATPase family AAA domain-containing protein 2
Name:ATPase family AAA domain-containing protein 2
Type:PROTEIN
Mol. Mass.:158546.30
Organism:Homo sapiens (Human)
Description:ChEMBL_1500426
Residue:1390
BDBM50464134
NameBDBM50464134
Synonyms:CHEMBL4242484
TypeSmall organic molecule
Emp. Form.C30H37F2N5O
Mol. Mass.521.6445
SMILES[H][C@]12CC[C@]([H])(N1)[C@@H](CCC1CCC(F)(F)CC1)[C@@H](C2)Nc1ncc(-c2cncc(C)c2)c2cc(C)c(=O)[nH]c12