Reaction Details
TargetCysteinyl leukotriene receptor 1
LigandBDBM50025103
Substrate/Competitorn/a
Meas. Tech.ChEBML_52219
Ki 8600±n/a nM
Citation Young, RNBélanger, PChampion, EDeHaven, RNDenis, DFord-Hutchinson, AWFortin, RFrenette, RGauthier, JYGillard, J Design and synthesis of sodium (beta R*, gamma S*)-4-[[3-(4-acetyl-3-hydroxy-2-propylphenoxy)propyl] thio]-gamma-hydroxy-beta-methylbenzenebutanoate: a novel, selective, and orally active receptor antagonist of leukotriene D4. J Med Chem29:1573-6 (1986) Cysteinyl leukotriene receptor 1
Name:Cysteinyl leukotriene receptor 1
Type:Enzyme Catalytic Domain
Mol. Mass.:39007.58
Organism:GUINEA PIG
Description:Leukotriene D4 0 GUINEA PIG::Q2NNR5
Residue:340
BDBM50025103
NameBDBM50025103
Synonyms:CHEMBL41301 | Sodium; 4-{4-[3-(4-acetyl-3-hydroxy-2-propyl-phenoxy)-propylsulfanyl]-phenyl}-4-hydroxy-3-methyl-butyrate
TypeSmall organic molecule
Emp. Form.C25H31O6S
Mol. Mass.459.576
SMILESCCCc1c(O)c(ccc1OCCCSc1ccc(cc1)C(O)[C@@H](C)CC([O-])=O)C(C)=O