Reaction Details
TargetMultidrug resistance-associated protein 1
LigandBDBM50465858
Substrate/Competitorn/a
Meas. Tech.ChEMBL_1788926 (CHEMBL4260660)
EC50 103±n/a nM
Citation Wong, ILKZhu, XChan, KFLaw, MCLo, AMYHu, XChow, LMCChan, TH Discovery of Novel Flavonoid Dimers To Reverse Multidrug Resistance Protein 1 (MRP1, ABCC1) Mediated Drug Resistance in Cancers Using a High Throughput Platform with "Click Chemistry". J Med Chem61:9931-9951 (2018) 
 
Multidrug resistance-associated protein 1
Name:Multidrug resistance-associated protein 1
Type:n/a
Mol. Mass.:171597.72
Organism:Homo sapiens (Human)
Description:P33527
Residue:1531
BDBM50465858
NameBDBM50465858
Synonyms:CHEMBL4277727
TypeSmall organic molecule
Emp. Form.C41H37N3O7
Mol. Mass.683.7484
SMILESCc1ccc2oc(cc(=O)c2c1)-c1ccc(OCCCCc2cn(CCOCCOc3ccc(cc3)-c3cc(=O)c4ccccc4o3)nn2)cc1