Reaction Details
TargetMultidrug resistance-associated protein 1
LigandBDBM50465860
Substrate/Competitorn/a
Meas. Tech.ChEMBL_1788926 (CHEMBL4260660)
EC50 78±n/a nM
Citation Wong, ILKZhu, XChan, KFLaw, MCLo, AMYHu, XChow, LMCChan, TH Discovery of Novel Flavonoid Dimers To Reverse Multidrug Resistance Protein 1 (MRP1, ABCC1) Mediated Drug Resistance in Cancers Using a High Throughput Platform with "Click Chemistry". J Med Chem61:9931-9951 (2018) 
 
Multidrug resistance-associated protein 1
Name:Multidrug resistance-associated protein 1
Type:n/a
Mol. Mass.:171597.72
Organism:Homo sapiens (Human)
Description:P33527
Residue:1531
BDBM50465860
NameBDBM50465860
Synonyms:CHEMBL4282529
TypeSmall organic molecule
Emp. Form.C46H40N4O7
Mol. Mass.760.8324
SMILESO=c1cc(oc2ccccc12)-c1ccc(OCCOCCn2cc(CN(CCOc3ccc4c(c3)oc(cc4=O)-c3ccccc3)Cc3ccccc3)nn2)cc1